Reaction Details
TargetBifunctional epoxide hydrolase 2
LigandBDBM25744
Substrate/Competitorn/a
Meas. Tech.ChEMBL_1456719 (CHEMBL3371009)
IC50 79±n/a nM
Citation Lee, KSLiu, JYWagner, KMPakhomova, SDong, HMorisseau, CFu, SHYang, JWang, PUlu, AMate, CANguyen, LVHwang, SHEdin, MLMara, AAWulff, HNewcomer, MEZeldin, DCHammock, BD Optimized inhibitors of soluble epoxide hydrolase improve in vitro target residence time and in vivo efficacy. J Med Chem57:7016-30 (2014) 
 
Bifunctional epoxide hydrolase 2
Name:Bifunctional epoxide hydrolase 2
Type:PROTEIN
Mol. Mass.:62337.15
Organism:Rattus norvegicus
Description:ChEMBL_1465995
Residue:554
BDBM25744
NameBDBM25744
Synonyms:3-(1-acetylpiperidin-4-yl)-1-[4-(trifluoromethoxy)phenyl]urea US8501783, 1555 | Urea-based compound, 25
TypeSmall organic molecule
Emp. Form.C15H18F3N3O3
Mol. Mass.345.3169
SMILESCC(=O)N1CCC(CC1)NC(=O)Nc1ccc(OC(F)(F)F)cc1