Reaction Details
TargetBifunctional epoxide hydrolase 2
LigandBDBM50100528
Substrate/Competitorn/a
Meas. Tech.ChEMBL_1455803 (CHEMBL3361515)
Ki<0.020000±n/a nM
Citation Lee, KSLiu, JYWagner, KMPakhomova, SDong, HMorisseau, CFu, SHYang, JWang, PUlu, AMate, CANguyen, LVHwang, SHEdin, MLMara, AAWulff, HNewcomer, MEZeldin, DCHammock, BD Optimized inhibitors of soluble epoxide hydrolase improve in vitro target residence time and in vivo efficacy. J Med Chem57:7016-30 (2014) 
 
Bifunctional epoxide hydrolase 2
Name:Bifunctional epoxide hydrolase 2
Type:Enzyme
Mol. Mass.:62613.07
Organism:Homo sapiens (Human)
Description:P34913
Residue:555
BDBM50100528
NameBDBM50100528
Synonyms:CHEMBL3327081
TypeSmall organic molecule
Emp. Form.C18H17F10N3O2
Mol. Mass.497.3305
SMILESFC(F)(F)CC(=O)N1CCC(CC1)NC(=O)Nc1ccc(cc1)C(F)(C(F)(F)F)C(F)(F)F