Reaction Details
TargetHepatocyte growth factor receptor
LigandBDBM50100615
Substrate/Competitorn/a
Meas. Tech.ChEMBL_1457677 (CHEMBL3368963)
IC50 20±n/a nM
Citation Shi, LWu, TTWang, ZXue, JYXu, YG Discovery of quinazolin-4-amines bearing benzimidazole fragments as dual inhibitors of c-Met and VEGFR-2. Bioorg Med Chem22:4735-44 (2014) 
 
Hepatocyte growth factor receptor
Name:Hepatocyte growth factor receptor
Type:Protein
Mol. Mass.:155559.73
Organism:Homo sapiens (Human)
Description:P08581
Residue:1390
BDBM50100615
NameBDBM50100615
Synonyms:E-7050 Golvatinib
TypeSmall organic molecule
Emp. Form.C33H37F2N7O4
Mol. Mass.633.6882
SMILESCN1CCN(CC1)C1CCN(CC1)C(=O)Nc1cc(Oc2ccc(NC(=O)C3(CC3)C(=O)Nc3ccc(F)cc3)c(F)c2)ccn1