Reaction Details
TargetDipeptidyl peptidase 4
LigandBDBM50102852
Substrate/Competitorn/a
Meas. Tech.ChEMBL_1455948 (CHEMBL3365706)
IC50 45±n/a nM
Citation Shu, CGe, HSong, MChen, JHZhou, HQi, QWang, FMa, XYang, XZhang, GDing, YZhou, DPeng, PShih, CKXu, JWu, F Discovery of Imigliptin, a Novel Selective DPP-4 Inhibitor for the Treatment of Type 2 Diabetes. ACS Med Chem Lett5:921-6 (2014) 
 
Dipeptidyl peptidase 4
Name:Dipeptidyl peptidase 4
Type:Enzyme
Mol. Mass.:88271.01
Organism:Homo sapiens (Human)
Description:P27487
Residue:766
BDBM50102852
NameBDBM50102852
Synonyms:CHEMBL3329633
TypeSmall organic molecule
Emp. Form.C21H23N5O
Mol. Mass.361.4402
SMILESCn1c2cccc(N3CCC[C@@H](N)C3)c2n(Cc2ccccc2C#N)c1=O