Reaction Details
TargetDipeptidyl peptidase 8
LigandBDBM50102865
Substrate/Competitorn/a
Meas. Tech.ChEMBL_1455949 (CHEMBL3365707)
IC50>100000±n/a nM
Citation Shu, CGe, HSong, MChen, JHZhou, HQi, QWang, FMa, XYang, XZhang, GDing, YZhou, DPeng, PShih, CKXu, JWu, F Discovery of Imigliptin, a Novel Selective DPP-4 Inhibitor for the Treatment of Type 2 Diabetes. ACS Med Chem Lett5:921-6 (2014) 
 
Dipeptidyl peptidase 8
Name:Dipeptidyl peptidase 8
Type:Enzyme
Mol. Mass.:103342.62
Organism:Homo sapiens (Human)
Description:Q6V1X1
Residue:898
BDBM50102865
NameBDBM50102865
Synonyms:CHEMBL3329627
TypeSmall organic molecule
Emp. Form.C20H22N6O
Mol. Mass.362.4283
SMILESCn1c2nccc(N3CCC[C@@H](N)C3)c2n(Cc2ccccc2C#N)c1=O