Reaction Details
TargetCytochrome P450 2A13
LigandBDBM50024210
Substrate/Competitorn/a
Meas. Tech.ChEMBL_1488921 (CHEMBL3535230)
Kd 5200±n/a nM
Citation Stephens, ESWalsh, AAScott, EE Evaluation of inhibition selectivity for human cytochrome P450 2A enzymes. Drug Metab Dispos40:1797-802 (2012) 
 
Cytochrome P450 2A13
Name:Cytochrome P450 2A13
Type:Protein
Mol. Mass.:56702.46
Organism:Homo sapiens (Human)
Description:Q16696
Residue:494
BDBM50024210
NameBDBM50024210
Synonyms:1H-indole-3-ethanamine 2-(3-indolyl)ethylamine tryptamine
TypeSmall organic molecule
Emp. Form.C10H12N2
Mol. Mass.160.2157
SMILESNCCc1c[nH]c2ccccc12