Reaction Details
TargetcAMP and cAMP-inhibited cGMP 3',5'-cyclic phosphodiesterase 10A
LigandBDBM31592
Substrate/Competitorn/a
Meas. Tech.ChEMBL_1461091 (CHEMBL3395317)
IC50 0.180000±n/a nM
Citation Yang, HMurigi, FNWang, ZLi, JJin, HTu, Z Synthesis and in vitro characterization of cinnoline and benzimidazole analogues as phosphodiesterase 10A inhibitors. Bioorg Med Chem Lett25:919-24 (2015) 
 
cAMP and cAMP-inhibited cGMP 3',5'-cyclic phosphodiesterase 10A
Name:cAMP and cAMP-inhibited cGMP 3',5'-cyclic phosphodiesterase 10A
Type:Protein
Mol. Mass.:88412.52
Organism:Homo sapiens (Human)
Description:Q9Y233
Residue:1055
BDBM31592
NameBDBM31592
Synonyms:PF-2545920 substituted pyrazole, 9
TypeSmall organic molecule
Emp. Form.C25H20N4O
Mol. Mass.392.4525
SMILESCn1cc(c(n1)-c1ccc(OCc2ccc3ccccc3n2)cc1)-c1ccncc1