Reaction Details
TargetCytochrome P450 2J2
LigandBDBM50017376
Substrate/Competitorn/a
Meas. Tech.ChEMBL_1487322 (CHEMBL3535114)
IC50 1830±n/a nM
Citation Lee, CAJones, JPKatayama, JKaspera, RJiang, YFreiwald, SSmith, EWalker, GSTotah, RA Identifying a selective substrate and inhibitor pair for the evaluation of CYP2J2 activity. Drug Metab Dispos40:943-51 (2012) 
 
Cytochrome P450 2J2
Name:Cytochrome P450 2J2
Type:Enzyme
Mol. Mass.:57623.04
Organism:Homo sapiens (Human)
Description:P51589
Residue:502
BDBM50017376
NameBDBM50017376
Synonyms:(+/-)1-(4-tert-butylphenyl)-4-(4-(hydroxydiphenylmethyl)piperidin-1-yl)butan-1-ol 1-(4-tert-Butyl-phenyl)-4-[4-(hydroxy-diphenyl-methyl)-piperidin-1-yl]-butan-1-ol(Terfenadine) CHEMBL17157 teraenadine
TypeSmall organic molecule
Emp. Form.C32H41NO2
Mol. Mass.471.6734
SMILESCC(C)(C)c1ccc(cc1)C(O)CCCN1CCC(CC1)C(O)(c1ccccc1)c1ccccc1