Reaction Details
TargetCytochrome P450 2D6
LigandBDBM50101815
Substrate/Competitorn/a
Meas. Tech.ChEMBL_1487308 (CHEMBL3534775)
IC50 1590±n/a nM
Citation Lee, CAJones, JPKatayama, JKaspera, RJiang, YFreiwald, SSmith, EWalker, GSTotah, RA Identifying a selective substrate and inhibitor pair for the evaluation of CYP2J2 activity. Drug Metab Dispos40:943-51 (2012) 
 
Cytochrome P450 2D6
Name:Cytochrome P450 2D6
Type:Protein
Mol. Mass.:55774.82
Organism:Homo sapiens (Human)
Description:P10635
Residue:497
BDBM50101815
NameBDBM50101815
Synonyms:CHEBI:7550 | Nicardipine
TypeSmall organic molecule
Emp. Form.C26H29N3O6
Mol. Mass.479.525
SMILESCOC(=O)C1=C(C)NC(C)=C(C1c1cccc(c1)[N+]([O-])=O)C(=O)OCCN(C)Cc1ccccc1