Reaction Details
TargetCytochrome P450 3A4
LigandBDBM50151865
Substrate/Competitorn/a
Meas. Tech.ChEMBL_1487309 (CHEMBL3534776)
IC50 667±n/a nM
Citation Lee, CAJones, JPKatayama, JKaspera, RJiang, YFreiwald, SSmith, EWalker, GSTotah, RA Identifying a selective substrate and inhibitor pair for the evaluation of CYP2J2 activity. Drug Metab Dispos40:943-51 (2012) 
 
Cytochrome P450 3A4
Name:Cytochrome P450 3A4
Type:Enzyme
Mol. Mass.:57349.57
Organism:Homo sapiens (Human)
Description:n/a
Residue:503
BDBM50151865
NameBDBM50151865
Synonyms:CHEMBL172 | MEFLOQUINE
TypeSmall organic molecule
Emp. Form.C17H16F6N2O
Mol. Mass.378.3122
SMILESO[C@H]([C@H]1CCCCN1)c1cc(nc2c(cccc12)C(F)(F)F)C(F)(F)F