Reaction Details
TargetCytochrome P450 1A2
LigandBDBM31774
Substrate/Competitorn/a
Meas. Tech.ChEMBL_1493769 (CHEMBL3530852)
IC50 1250±n/a nM
Citation Lee, CAJones, JPKatayama, JKaspera, RJiang, YFreiwald, SSmith, EWalker, GSTotah, RA Identifying a selective substrate and inhibitor pair for the evaluation of CYP2J2 activity. Drug Metab Dispos40:943-51 (2012) 
 
Cytochrome P450 1A2
Name:Cytochrome P450 1A2
Type:Enzyme
Mol. Mass.:58423.38
Organism:Homo sapiens (Human)
Description:P05177
Residue:516
BDBM31774
NameBDBM31774
Synonyms:CHEMBL104 Clotrimazole Mycelex cid_2812
TypeSmall organic molecule
Emp. Form.C22H17ClN2
Mol. Mass.344.837
SMILESClc1ccccc1C(c1ccccc1)(c1ccccc1)n1ccnc1