Reaction Details
TargetCytochrome P450 3A4
LigandBDBM50331515
Substrate/Competitorn/a
Meas. Tech.ChEMBL_1487309 (CHEMBL3534776)
IC50 24100±n/a nM
Citation Lee, CAJones, JPKatayama, JKaspera, RJiang, YFreiwald, SSmith, EWalker, GSTotah, RA Identifying a selective substrate and inhibitor pair for the evaluation of CYP2J2 activity. Drug Metab Dispos40:943-51 (2012) 
 
Cytochrome P450 3A4
Name:Cytochrome P450 3A4
Type:Enzyme
Mol. Mass.:57349.57
Organism:Homo sapiens (Human)
Description:n/a
Residue:503
BDBM50331515
NameBDBM50331515
Synonyms:CHEMBL1708 Paroxetine hydrochloride Paxil | Paxil cr
TypeSmall organic molecule
Emp. Form.C19H20FNO3
Mol. Mass.329.3654
SMILESFc1ccc(cc1)[C@@H]1CCNC[C@H]1COc1ccc2OCOc2c1