Reaction Details
TargetCytochrome P450 2C19
LigandBDBM50070208
Substrate/Competitorn/a
Meas. Tech.ChEMBL_1487307 (CHEMBL3534774)
IC50 13400±n/a nM
Citation Lee, CAJones, JPKatayama, JKaspera, RJiang, YFreiwald, SSmith, EWalker, GSTotah, RA Identifying a selective substrate and inhibitor pair for the evaluation of CYP2J2 activity. Drug Metab Dispos40:943-51 (2012) 
 
Cytochrome P450 2C19
Name:Cytochrome P450 2C19
Type:Enzyme
Mol. Mass.:55935.47
Organism:Homo sapiens (Human)
Description:P33261
Residue:490
BDBM50070208
NameBDBM50070208
Synonyms:A-65006 CHEBI:6375 Prevacid Prevacid Delayed Release Prevacid iv
TypeSmall organic molecule
Emp. Form.C16H14F3N3O2S
Mol. Mass.369.361
SMILESCc1c(OCC(F)(F)F)ccnc1C[S+]([O-])c1nc2ccccc2[nH]1