Reaction Details
TargetCytochrome P450 3A4
LigandBDBM50070208
Substrate/Competitorn/a
Meas. Tech.ChEMBL_1487309 (CHEMBL3534776)
IC50>30000±n/a nM
Citation Lee, CAJones, JPKatayama, JKaspera, RJiang, YFreiwald, SSmith, EWalker, GSTotah, RA Identifying a selective substrate and inhibitor pair for the evaluation of CYP2J2 activity. Drug Metab Dispos40:943-51 (2012) 
 
Cytochrome P450 3A4
Name:Cytochrome P450 3A4
Type:Enzyme
Mol. Mass.:57349.57
Organism:Homo sapiens (Human)
Description:n/a
Residue:503
BDBM50070208
NameBDBM50070208
Synonyms:A-65006 CHEBI:6375 Prevacid Prevacid Delayed Release Prevacid iv
TypeSmall organic molecule
Emp. Form.C16H14F3N3O2S
Mol. Mass.369.361
SMILESCc1c(OCC(F)(F)F)ccnc1C[S+]([O-])c1nc2ccccc2[nH]1