Reaction Details
TargetCytochrome P450 2C9
LigandBDBM50334150
Substrate/Competitorn/a
Meas. Tech.ChEMBL_1493771 (CHEMBL3530854)
IC50>30000±n/a nM
Citation Lee, CAJones, JPKatayama, JKaspera, RJiang, YFreiwald, SSmith, EWalker, GSTotah, RA Identifying a selective substrate and inhibitor pair for the evaluation of CYP2J2 activity. Drug Metab Dispos40:943-51 (2012) 
 
Cytochrome P450 2C9
Name:Cytochrome P450 2C9
Type:Enzyme
Mol. Mass.:55636.33
Organism:Homo sapiens (Human)
Description:P11712
Residue:490
BDBM50334150
NameBDBM50334150
Synonyms:1-(1-(4,4-bis(4-fluorophenyl)butyl)piperidin-4-yl)-1H-benzo[d]imidazol-2(3H)-one 1-(1-{3-[Bis-(4-fluoro-phenyl)-amino]-propyl}-piperidin-4-yl)-1,3-dihydro-benzoimidazol-2-one(Pimozide) 1-{1-[4,4-Bis-(4-fluoro-phenyl)-butyl]-piperidin-4-yl}-1,3-dihydro-benzoimidazol-2-one(Pimozide) MCN-JR-6238 NCGC00015802 PIMOZIDE1-{1-[4,4-BIS-(4-FLUORO-PHENYL)-BUTYL]-PIPERIDIN-4-YL}-1,3-DIHYDRO-BENZOIMIDAZOL-2-ONE R-6238
TypeSmall organic molecule
Emp. Form.C28H29F2N3O
Mol. Mass.461.5462
SMILESFc1ccc(cc1)C(CCCN1CCC(CC1)n1c2ccccc2[nH]c1=O)c1ccc(F)cc1