Reaction Details
TargetCytochrome P450 1A2
LigandBDBM78577
Substrate/Competitorn/a
Meas. Tech.ChEMBL_1493769 (CHEMBL3530852)
IC50>30000±n/a nM
Citation Lee, CAJones, JPKatayama, JKaspera, RJiang, YFreiwald, SSmith, EWalker, GSTotah, RA Identifying a selective substrate and inhibitor pair for the evaluation of CYP2J2 activity. Drug Metab Dispos40:943-51 (2012) 
 
Cytochrome P450 1A2
Name:Cytochrome P450 1A2
Type:Enzyme
Mol. Mass.:58423.38
Organism:Homo sapiens (Human)
Description:P05177
Residue:516
BDBM78577
NameBDBM78577
Synonyms:BEPRIDIL HYDROCHLORIDE MLS000028456 N-[3-(2-methylpropoxy)-2-pyrrolidin-1-yl-propyl]-N-(phenylmethyl)aniline;hydrochloride SMR000058419 cid_50088
TypeSmall organic molecule
Emp. Form.C24H34N2O
Mol. Mass.366.5396
SMILESCC(C)COCC(CN(Cc1ccccc1)c1ccccc1)N1CCCC1