Reaction Details
TargetSodium channel protein type 9 subunit alpha
LigandBDBM50103584
Substrate/Competitorn/a
Meas. Tech.ChEMBL_1435612 (CHEMBL3386535)
IC50 73±n/a nM
Citation Yang, SWHo, GDTulshian, DBercovici, ATan, ZHanisak, JBrumfield, SMatasi, JSun, XSakwa, SAHerr, RJZhou, XBridal, TUrban, MVivian, JRindgen, DSorota, S Bioavailable pyrrolo-benzo-1,4-diazines as Na(v)1.7 sodium channel blockers for the treatment of pain. Bioorg Med Chem Lett24:4958-62 (2014) 
 
Sodium channel protein type 9 subunit alpha
Name:Sodium channel protein type 9 subunit alpha
Type:Protein
Mol. Mass.:226375.97
Organism:Homo sapiens (Human)
Description:Q15858
Residue:1988
BDBM50103584
NameBDBM50103584
Synonyms:CHEMBL3337595
TypeSmall organic molecule
Emp. Form.C28H32N4O3
Mol. Mass.472.5787
SMILESCOc1ccc-2c(NC3(CCN(CC3)C(=O)c3ccc(OC)c(c3)N3CCCC3)c3cccn-23)c1