Reaction Details
TargetHepatocyte growth factor receptor
LigandBDBM50103902
Substrate/Competitorn/a
Meas. Tech.ChEMBL_1505168 (CHEMBL3594710)
IC50 8.1±n/a nM
Citation Liao, WHu, GGuo, ZSun, DZhang, LBu, YLi, YLiu, YGong, P Design and biological evaluation of novel 4-(2-fluorophenoxy)quinoline derivatives bearing an imidazolone moiety as c-Met kinase inhibitors. Bioorg Med Chem23:4410-22 (2015) 
 
Hepatocyte growth factor receptor
Name:Hepatocyte growth factor receptor
Type:Protein
Mol. Mass.:155559.73
Organism:Homo sapiens (Human)
Description:P08581
Residue:1390
BDBM50103902
NameBDBM50103902
Synonyms:CHEMBL3594102
TypeSmall organic molecule
Emp. Form.C37H38F4N6O5
Mol. Mass.722.7284
SMILESCOc1cc2c(Oc3ccc(NC(=O)c4c(C)n(-c5ccccc5C(F)(F)F)c(=O)n4C)cc3F)ccnc2cc1OCCCN1CCN(C)CC1