Reaction Details
TargetTranslocator protein
LigandBDBM50104788
Substrate/Competitorn/a
Meas. Tech.ChEMBL_1508094 (CHEMBL3599695)
Ki 5.8±n/a nM
Citation Barresi, EBruno, ATaliani, SCosconati, SDa Pozzo, ESalerno, SSimorini, FDaniele, SGiacomelli, CMarini, AMLa Motta, CMarinelli, LCosimelli, BNovellino, EGreco, GDa Settimo, FMartini, C Deepening the Topology of the Translocator Protein Binding Site by Novel N,N-Dialkyl-2-arylindol-3-ylglyoxylamides. J Med Chem58:6081-92 (2015) 
 
Translocator protein
Name:Translocator protein
Type:Mitochondrion membrane protein
Mol. Mass.:18945.84
Organism:Rattus norvegicus (rat)
Description:Competitive binding experiments were performed on rat kidney mitochondrial membranes.
Residue:169
BDBM50104788
NameBDBM50104788
Synonyms:CHEMBL3597365
TypeSmall organic molecule
Emp. Form.C23H26N2O3
Mol. Mass.378.4641
SMILESCCCN(CCC)C(=O)C(=O)c1c([nH]c2ccccc12)-c1ccc(OC)cc1