Reaction Details
TargetCannabinoid receptor 1
LigandBDBM50108988
Substrate/Competitorn/a
Meas. Tech.ChEMBL_1507860 (CHEMBL3598796)
Ki 590±n/a nM
Citation Kleigrewe, KAlmaliti, JTian, IYKinnel, RBKorobeynikov, AMonroe, EADuggan, BMDi Marzo, VSherman, DHDorrestein, PCGerwick, LGerwick, WH Combining Mass Spectrometric Metabolic Profiling with Genomic Analysis: A Powerful Approach for Discovering Natural Products from Cyanobacteria. J Nat Prod78:1671-82 (2015) 
 
Cannabinoid receptor 1
Name:Cannabinoid receptor 1
Type:G Protein-Coupled Receptor (GPCR)
Mol. Mass.:52868.96
Organism:Homo sapiens (Human)
Description:P21554
Residue:472
BDBM50108988
NameBDBM50108988
Synonyms:CHEMBL3597330
TypeSmall organic molecule
Emp. Form.C23H41Cl2NO4
Mol. Mass.466.482
SMILESCOC[C@@H](COC(C)=O)N(C)C(=O)CC\C=C\CCCCC(Cl)CCCCCCCl