Reaction Details
TargetAmine oxidase [flavin-containing] A
LigandBDBM50111776
Substrate/Competitorn/a
Meas. Tech.ChEMBL_1510679 (CHEMBL3606165)
IC50 220±n/a nM
Citation Otto, RPenzis, RGaube, FAdolph, OFöhr, KJWarncke, PRobaa, DAppenroth, DFleck, CEnzensperger, CLehmann, JWinckler, T Evaluation of Homobivalent Carbolines as Designed Multiple Ligands for the Treatment of Neurodegenerative Disorders. J Med Chem58:6710-5 (2015) 
 
Amine oxidase [flavin-containing] A
Name:Amine oxidase [flavin-containing] A
Type:Protein
Mol. Mass.:59689.53
Organism:Homo sapiens (Human)
Description:P21397
Residue:527
BDBM50111776
NameBDBM50111776
Synonyms:CHEMBL3605361
TypeSmall organic molecule
Emp. Form.C33H38I2N4
Mol. Mass.744.4906
SMILES[I-].[I-].C[n+]1ccc2n(CCCCCCCCCn3c4ccccc4c4c[n+](C)ccc34)c3ccccc3c2c1