Reaction Details
TargetAmine oxidase [flavin-containing] B
LigandBDBM50111775
Substrate/Competitorn/a
Meas. Tech.ChEMBL_1510680 (CHEMBL3606166)
IC50 66±n/a nM
Citation Otto, RPenzis, RGaube, FAdolph, OFöhr, KJWarncke, PRobaa, DAppenroth, DFleck, CEnzensperger, CLehmann, JWinckler, T Evaluation of Homobivalent Carbolines as Designed Multiple Ligands for the Treatment of Neurodegenerative Disorders. J Med Chem58:6710-5 (2015) 
 
Amine oxidase [flavin-containing] B
Name:Amine oxidase [flavin-containing] B
Type:Protein
Mol. Mass.:58768.76
Organism:Homo sapiens (Human)
Description:P27338
Residue:520
BDBM50111775
NameBDBM50111775
Synonyms:CHEMBL3605360
TypeSmall organic molecule
Emp. Form.C32H36I2N4
Mol. Mass.730.464
SMILES[I-].[I-].C[n+]1ccc2n(CCCCCCCCn3c4ccccc4c4c[n+](C)ccc34)c3ccccc3c2c1