Reaction Details
TargetCholinesterase
LigandBDBM50111774
Substrate/Competitorn/a
Meas. Tech.ChEMBL_1510667 (CHEMBL3608118)
IC50 47±n/a nM
Citation Otto, RPenzis, RGaube, FAdolph, OFöhr, KJWarncke, PRobaa, DAppenroth, DFleck, CEnzensperger, CLehmann, JWinckler, T Evaluation of Homobivalent Carbolines as Designed Multiple Ligands for the Treatment of Neurodegenerative Disorders. J Med Chem58:6710-5 (2015) 
 
Cholinesterase
Name:Cholinesterase
Type:Enzyme
Mol. Mass.:65643.35
Organism:Equus caballus (Horse)
Description:P81908
Residue:574
BDBM50111774
NameBDBM50111774
Synonyms:CHEMBL3605359
TypeSmall organic molecule
Emp. Form.C31H34I2N4
Mol. Mass.716.4374
SMILES[I-].[I-].C[n+]1ccc2n(CCCCCCCn3c4ccccc4c4c[n+](C)ccc34)c3ccccc3c2c1