Reaction Details
TargetCholinesterase
LigandBDBM50111771
Substrate/Competitorn/a
Meas. Tech.ChEMBL_1510667 (CHEMBL3608118)
IC50 13±n/a nM
Citation Otto, RPenzis, RGaube, FAdolph, OFöhr, KJWarncke, PRobaa, DAppenroth, DFleck, CEnzensperger, CLehmann, JWinckler, T Evaluation of Homobivalent Carbolines as Designed Multiple Ligands for the Treatment of Neurodegenerative Disorders. J Med Chem58:6710-5 (2015) 
 
Cholinesterase
Name:Cholinesterase
Type:Enzyme
Mol. Mass.:65643.35
Organism:Equus caballus (Horse)
Description:P81908
Residue:574
BDBM50111771
NameBDBM50111771
Synonyms:CHEMBL3605356
TypeSmall organic molecule
Emp. Form.C31H32N4
Mol. Mass.460.6126
SMILESC(CCCCn1c2ccccc2c2cnccc12)CCCCn1c2ccccc2c2cnccc12