Reaction Details
TargetAcetylcholinesterase
LigandBDBM50111785
Substrate/Competitorn/a
Meas. Tech.ChEMBL_1510666 (CHEMBL3608117)
IC50 7.4±n/a nM
Citation Otto, RPenzis, RGaube, FAdolph, OFöhr, KJWarncke, PRobaa, DAppenroth, DFleck, CEnzensperger, CLehmann, JWinckler, T Evaluation of Homobivalent Carbolines as Designed Multiple Ligands for the Treatment of Neurodegenerative Disorders. J Med Chem58:6710-5 (2015) 
 
Acetylcholinesterase
Name:Acetylcholinesterase
Type:Enzyme
Mol. Mass.:71812.79
Organism:Electrophorus electricus (Electric eel)
Description:n/a
Residue:633
BDBM50111785
NameBDBM50111785
Synonyms:CHEMBL3605370
TypeSmall organic molecule
Emp. Form.C35H48N4O2
Mol. Mass.556.7812
SMILESCOc1ccc2n(CCCCCCCCCn3c4CCN(C)Cc4c4cc(OC)ccc34)c3CCN(C)Cc3c2c1