Reaction Details
TargetAcetylcholinesterase
LigandBDBM50111771
Substrate/Competitorn/a
Meas. Tech.ChEMBL_1510666 (CHEMBL3608117)
IC50 40±n/a nM
Citation Otto, RPenzis, RGaube, FAdolph, OFöhr, KJWarncke, PRobaa, DAppenroth, DFleck, CEnzensperger, CLehmann, JWinckler, T Evaluation of Homobivalent Carbolines as Designed Multiple Ligands for the Treatment of Neurodegenerative Disorders. J Med Chem58:6710-5 (2015) 
 
Acetylcholinesterase
Name:Acetylcholinesterase
Type:Enzyme
Mol. Mass.:71812.79
Organism:Electrophorus electricus (Electric eel)
Description:n/a
Residue:633
BDBM50111771
NameBDBM50111771
Synonyms:CHEMBL3605356
TypeSmall organic molecule
Emp. Form.C31H32N4
Mol. Mass.460.6126
SMILESC(CCCCn1c2ccccc2c2cnccc12)CCCCn1c2ccccc2c2cnccc12