Reaction Details
TargetAcetylcholinesterase
LigandBDBM50111768
Substrate/Competitorn/a
Meas. Tech.ChEMBL_1510666 (CHEMBL3608117)
IC50 473±n/a nM
Citation Otto, RPenzis, RGaube, FAdolph, OFöhr, KJWarncke, PRobaa, DAppenroth, DFleck, CEnzensperger, CLehmann, JWinckler, T Evaluation of Homobivalent Carbolines as Designed Multiple Ligands for the Treatment of Neurodegenerative Disorders. J Med Chem58:6710-5 (2015) 
 
Acetylcholinesterase
Name:Acetylcholinesterase
Type:Enzyme
Mol. Mass.:71812.79
Organism:Electrophorus electricus (Electric eel)
Description:n/a
Residue:633
BDBM50111768
NameBDBM50111768
Synonyms:CHEMBL3605353
TypeSmall organic molecule
Emp. Form.C28H26N4
Mol. Mass.418.5328
SMILESC(CCCn1c2ccccc2c2cnccc12)CCn1c2ccccc2c2cnccc12