Reaction Details
TargetCholinesterase
LigandBDBM50111783
Substrate/Competitorn/a
Meas. Tech.ChEMBL_1510667 (CHEMBL3608118)
IC50 43±n/a nM
Citation Otto, RPenzis, RGaube, FAdolph, OFöhr, KJWarncke, PRobaa, DAppenroth, DFleck, CEnzensperger, CLehmann, JWinckler, T Evaluation of Homobivalent Carbolines as Designed Multiple Ligands for the Treatment of Neurodegenerative Disorders. J Med Chem58:6710-5 (2015) 
 
Cholinesterase
Name:Cholinesterase
Type:Enzyme
Mol. Mass.:65643.35
Organism:Equus caballus (Horse)
Description:P81908
Residue:574
BDBM50111783
NameBDBM50111783
Synonyms:CHEMBL3605368
TypeSmall organic molecule
Emp. Form.C32H42N4
Mol. Mass.482.7027
SMILESCN1CCc2c(C1)c1ccccc1n2CCCCCCCCn1c2CCN(C)Cc2c2ccccc12