Reaction Details
TargetIsocitrate dehydrogenase [NADP] cytoplasmic
LigandBDBM50111796
Substrate/Competitorn/a
Meas. Tech.ChEMBL_1510691 (CHEMBL3606177)
Kd 8900±n/a nM
Citation Wu, FJiang, HZheng, BKogiso, MYao, YZhou, CLi, XNSong, Y Inhibition of Cancer-Associated Mutant Isocitrate Dehydrogenases by 2-Thiohydantoin Compounds. J Med Chem58:6899-908 (2015) 
 
Isocitrate dehydrogenase [NADP] cytoplasmic
Name:Isocitrate dehydrogenase [NADP] cytoplasmic
Type:Protein
Mol. Mass.:46661.29
Organism:Homo sapiens (Human)
Description:O75874
Residue:414
BDBM50111796
NameBDBM50111796
Synonyms:CHEMBL3605384
TypeSmall organic molecule
Emp. Form.C9H7N3O2S
Mol. Mass.221.236
SMILESO=C1NC(=S)N\C1=C\c1ccc(=O)[nH]c1