Reaction Details
TargetIsocitrate dehydrogenase [NADP] cytoplasmic
LigandBDBM50111800
Substrate/Competitorn/a
Meas. Tech.ChEMBL_1510685 (CHEMBL3606171)
Ki 32900±n/a nM
Citation Wu, FJiang, HZheng, BKogiso, MYao, YZhou, CLi, XNSong, Y Inhibition of Cancer-Associated Mutant Isocitrate Dehydrogenases by 2-Thiohydantoin Compounds. J Med Chem58:6899-908 (2015) 
 
Isocitrate dehydrogenase [NADP] cytoplasmic
Name:Isocitrate dehydrogenase [NADP] cytoplasmic
Type:Protein
Mol. Mass.:46661.29
Organism:Homo sapiens (Human)
Description:O75874
Residue:414
BDBM50111800
NameBDBM50111800
Synonyms:CHEMBL3605388
TypeSmall organic molecule
Emp. Form.C17H15N3O2S
Mol. Mass.325.385
SMILESCN1C(=S)N\C(=C\c2ccc(=O)n(Cc3ccccc3)c2)C1=O