Reaction Details
TargetDNA gyrase subunit A/B
LigandBDBM50112815
Substrate/Competitorn/a
Meas. Tech.ChEMBL_1513890 (CHEMBL3611455)
Ki<17.7±n/a nM
Citation O'Dowd, HShannon, DEChandupatla, KRDixit, VEngtrakul, JJYe, ZJones, SMO'Brien, CFNicolau, DPTessier, PRCrandon, JLSong, BMacikenas, DHanzelka, BLLe Tiran, ABennani, YLCharifson, PSGrillot, AL Discovery and Characterization of a Water-Soluble Prodrug of a Dual Inhibitor of Bacterial DNA Gyrase and Topoisomerase IV. ACS Med Chem Lett6:822-6 (2015) 
 
DNA gyrase subunit A/B
Name:DNA gyrase subunit A/B
Synonyms:DNA Gyrase
Type:A2B2 tetramer
Mol. Mass.:n/a
Description:n/a
Components:This complex has 2 components.
Component 1
Name:DNA gyrase subunit A
Type:Enzyme Subunit
Mol. Mass.:99588.82
Organism:Staphylococcus aureus
Description:n/a
Residue:889
Component 2
Name:DNA gyrase subunit B
Synonyms:DNA gyrase DNA gyrase subunit B (gyrB) gyrB
Type:Enzyme Subunit
Mol. Mass.:72530.91
Organism:Staphylococcus aureus
Description:n/a
Residue:644
BDBM50112815
NameBDBM50112815
Synonyms:CHEMBL2221212
TypeSmall organic molecule
Emp. Form.C21H26FN6O6P
Mol. Mass.508.4399
SMILESCCNC(=O)Nc1nc2cc(c(F)c([C@H]3CCCO3)c2[nH]1)-c1cnc(nc1)C(C)(C)OP(O)(O)=O