Reaction Details
TargetNeuronal acetylcholine receptor subunit alpha-7
LigandBDBM50114008
Substrate/Competitorn/a
Meas. Tech.ChEMBL_1510986 (CHEMBL3607039)
Ki 29±n/a nM
Citation Bolchi, CValoti, EGotti, CFasoli, FRuggeri, PFumagalli, LBinda, MMucchietto, VSciaccaluga, MBudriesi, RFucile, SPallavicini, M Chemistry and Pharmacology of a Series of Unichiral Analogues of 2-(2-Pyrrolidinyl)-1,4-benzodioxane, Prolinol Phenyl Ether, and Prolinol 3-Pyridyl Ether Designed asa4ß2-Nicotinic Acetylcholine Receptor Agonists. J Med Chem58:6665-77 (2015) 
 
Neuronal acetylcholine receptor subunit alpha-7
Name:Neuronal acetylcholine receptor subunit alpha-7
Type:Enzyme
Mol. Mass.:56502.44
Organism:Rattus norvegicus (Rat)
Description:Q05941
Residue:502
BDBM50114008
NameBDBM50114008
Synonyms:CHEMBL3603931
TypeSmall organic molecule
Emp. Form.C11H15NO2
Mol. Mass.193.2423
SMILESCN1CC[C@H]1COc1cccc(O)c1