Reaction Details
TargetNeuronal acetylcholine receptor subunit alpha-4/beta-2
LigandBDBM50382474
Substrate/Competitorn/a
Meas. Tech.ChEMBL_1510989 (CHEMBL3607042)
EC50 0.270000±n/a nM
Citation Bolchi, CValoti, EGotti, CFasoli, FRuggeri, PFumagalli, LBinda, MMucchietto, VSciaccaluga, MBudriesi, RFucile, SPallavicini, M Chemistry and Pharmacology of a Series of Unichiral Analogues of 2-(2-Pyrrolidinyl)-1,4-benzodioxane, Prolinol Phenyl Ether, and Prolinol 3-Pyridyl Ether Designed asa4ß2-Nicotinic Acetylcholine Receptor Agonists. J Med Chem58:6665-77 (2015) 
 
Neuronal acetylcholine receptor subunit alpha-4/beta-2
Name:Neuronal acetylcholine receptor subunit alpha-4/beta-2
Type:Protein
Mol. Mass.:n/a
Description:n/a
Components:This complex has 2 components.
Component 1
Name:Neuronal acetylcholine receptor subunit alpha-4
Synonyms:ACHA4_HUMAN CHRNA4 protein Neuronal acetylcholine receptor protein alpha-4 subunit Nicotinic acetylcholine receptor alpha4/beta2/alpha5
Type:n/a
Mol. Mass.:69963.49
Organism:Homo sapiens (Human)
Description:NACHRA4
Residue:627
Component 2
Name:Neuronal acetylcholine receptor subunit beta-2
Synonyms:ACHB2_HUMAN Neuronal acetylcholine receptor protein beta-2 subunit | Nicotinic acetylcholine receptor alpha3/beta2/alpha5
Type:Protein
Mol. Mass.:57020.50
Organism:Homo sapiens (Human)
Description:P17787
Residue:502
BDBM50382474
NameBDBM50382474
Synonyms:CHEMBL2024096 | US9303017, Sazetidine-A
TypeSmall organic molecule
Emp. Form.C15H20N2O2
Mol. Mass.260.3315
SMILESOCCCCC#Cc1cncc(OC[C@@H]2CCN2)c1