Reaction Details
TargetGlyceraldehyde-3-phosphate dehydrogenase
LigandBDBM50114359
Substrate/Competitorn/a
Meas. Tech.ChEMBL_1511315 (CHEMBL3606220)
IC50 2410±n/a nM
Citation Prati, FBergamini, CMolina, MTFalchi, FCavalli, AKaiser, MBrun, RFato, RBolognesi, ML 2-Phenoxy-1,4-naphthoquinones: From a Multitarget Antitrypanosomal to a Potential Antitumor Profile. J Med Chem58:6422-34 (2015) 
 
Glyceraldehyde-3-phosphate dehydrogenase
Name:Glyceraldehyde-3-phosphate dehydrogenase
Type:PROTEIN
Mol. Mass.:36060.86
Organism:Homo sapiens (Human)
Description:ChEMBL_1511315
Residue:335
BDBM50114359
NameBDBM50114359
Synonyms:CHEMBL3604105
TypeSmall organic molecule
Emp. Form.C16H10O4
Mol. Mass.266.2482
SMILESOc1cccc2C(=O)C(Oc3ccccc3)=CC(=O)c12