Reaction Details
TargetMacrophage-stimulating protein receptor
LigandBDBM50115200
Substrate/Competitorn/a
Meas. Tech.ChEMBL_1513738 (CHEMBL3610848)
IC50 32±n/a nM
Citation Raeppel, FRaeppel, SLTherrien, E Design, synthesis and RON receptor tyrosine kinase inhibitory activity of new head groups analogs of LCRF-0004. Bioorg Med Chem Lett25:3810-5 (2015) 
 
Macrophage-stimulating protein receptor
Name:Macrophage-stimulating protein receptor
Type:Protein
Mol. Mass.:152270.76
Organism:Homo sapiens (Human)
Description:Q04912
Residue:1400
BDBM50115200
NameBDBM50115200
Synonyms:CHEMBL3608545
TypeSmall organic molecule
Emp. Form.C33H23FN6O2S
Mol. Mass.586.638
SMILESCn1cnc(c1)-c1cc2nccc(Oc3ccc(NC(=O)c4cn(nc4-c4ccccc4)-c4ccccc4)cc3F)c2s1