Reaction Details
TargetCytochrome P450 3A4
LigandBDBM50115393
Substrate/Competitorn/a
Meas. Tech.ChEMBL_1513925 (CHEMBL3611607)
IC50 38800±n/a nM
Citation Bagdanoff, JTJain, RHan, WZhu, SMadiera, AMLee, PSMa, XPoon, D Tetrahydropyrrolo-diazepenones as inhibitors of ERK2 kinase. Bioorg Med Chem Lett25:3788-92 (2015) 
 
Cytochrome P450 3A4
Name:Cytochrome P450 3A4
Type:Enzyme
Mol. Mass.:57349.57
Organism:Homo sapiens (Human)
Description:n/a
Residue:503
BDBM50115393
NameBDBM50115393
Synonyms:CHEMBL3608458
TypeSmall organic molecule
Emp. Form.C25H28FN5O3
Mol. Mass.465.5199
SMILESOC[C@@H](N1CCCn2cc(cc2C1=O)-c1ccnc(N[C@@H]2C[C@H](O)[C@@H](F)C2)n1)c1ccccc1