Reaction Details
TargetPurine nucleoside phosphorylase
LigandBDBM50116358
Substrate/Competitorn/a
Meas. Tech.ChEMBL_1511507 (CHEMBL3606856)
Ki 93±n/a nM
Citation Evans, GBCameron, SALuxenburger, AGuan, RSuarez, JThomas, KSchramm, VLTyler, PC Tight binding enantiomers of pre-clinical drug candidates. Bioorg Med Chem23:5326-33 (2015) 
 
Purine nucleoside phosphorylase
Name:Purine nucleoside phosphorylase
Type:Enzyme
Mol. Mass.:26857.85
Organism:Plasmodium falciparum
Description:n/a
Residue:245
BDBM50116358
NameBDBM50116358
Synonyms:CHEMBL3604359
TypeSmall organic molecule
Emp. Form.C13H18N4O2S
Mol. Mass.294.373
SMILESCSC[C@@H]1CN(Cc2c[nH]c3c(O)ncnc23)C[C@H]1O