Reaction Details
TargetS-methyl-5'-thioadenosine phosphorylase
LigandBDBM22113
Substrate/Competitorn/a
Meas. Tech.ChEMBL_1511510 (CHEMBL3606935)
Ki 0.530000±n/a nM
Citation Evans, GBCameron, SALuxenburger, AGuan, RSuarez, JThomas, KSchramm, VLTyler, PC Tight binding enantiomers of pre-clinical drug candidates. Bioorg Med Chem23:5326-33 (2015) 
 
S-methyl-5'-thioadenosine phosphorylase
Name:S-methyl-5'-thioadenosine phosphorylase
Type:Enzyme
Mol. Mass.:31239.23
Organism:Homo sapiens (Human)
Description:n/a
Residue:283
BDBM22113
NameBDBM22113
Synonyms:(3R,4S)-1-({4-amino-5H-pyrrolo[3,2-d]pyrimidin-7-yl}methyl)-4-[(methylsulfanyl)methyl]pyrrolidin-3-ol (3R,4S)-1-[(9-Deazaadenin-9-yl)methyl]-3-hydroxy-4-methylthiomethylpyrrolidine, 7 MT-DADMe-ImmA
Typen/a
Emp. Form.C13H19N5OS
Mol. Mass.293.388
SMILESCSC[C@H]1CN(Cc2c[nH]c3c(N)ncnc23)C[C@@H]1O