Reaction Details
TargetInsulin receptor
LigandBDBM50116681
Substrate/Competitorn/a
Meas. Tech.ChEMBL_1513260 (CHEMBL3610968)
IC50 2.0±n/a nM
Citation Kang, GALee, MSong, DLee, HKAhn, SPark, CHLee, COYun, CSJung, HKim, PHa, JDCho, SYKim, HRHwang, JY Synthesis and evaluation of novel 2,4-diaminopyrimidines bearing bicyclic aminobenzazepines for anaplastic lymphoma kinase (ALK) inhibitor. Bioorg Med Chem Lett25:3992-8 (2015) 
 
Insulin receptor
Name:Insulin receptor
Type:Receptor Tyrosine Kinase
Mol. Mass.:156322.60
Organism:Homo sapiens (Human)
Description:P06213
Residue:1382
BDBM50116681
NameBDBM50116681
Synonyms:CHEMBL3608524 | US10053458, 65
TypeSmall organic molecule
Emp. Form.C24H28ClN5O3S
Mol. Mass.502.029
SMILESCOc1cc2CCNCCc2cc1Nc1ncc(Cl)c(Nc2ccccc2S(=O)(=O)C(C)C)n1