Reaction Details
TargetALK tyrosine kinase receptor
LigandBDBM50436850
Substrate/Competitorn/a
Meas. Tech.ChEMBL_1513259 (CHEMBL3610967)
IC50 29±n/a nM
Citation Kang, GALee, MSong, DLee, HKAhn, SPark, CHLee, COYun, CSJung, HKim, PHa, JDCho, SYKim, HRHwang, JY Synthesis and evaluation of novel 2,4-diaminopyrimidines bearing bicyclic aminobenzazepines for anaplastic lymphoma kinase (ALK) inhibitor. Bioorg Med Chem Lett25:3992-8 (2015) 
 
ALK tyrosine kinase receptor
Name:ALK tyrosine kinase receptor
Type:Protein
Mol. Mass.:176453.10
Organism:Homo sapiens (Human)
Description:Q9UM73
Residue:1620
BDBM50436850
NameBDBM50436850
Synonyms:CERITINIB LDK378 US10618884, Example 16 | US9809572, Example 16
TypeSmall organic molecule
Emp. Form.C28H36ClN5O3S
Mol. Mass.558.135
SMILESCC(C)Oc1cc(C2CCNCC2)c(C)cc1Nc1ncc(Cl)c(Nc2ccccc2S(=O)(=O)C(C)C)n1