Reaction Details
TargetDiacylglycerol O-acyltransferase 1
LigandBDBM50117187
Substrate/Competitorn/a
Meas. Tech.ChEMBL_1513968 (CHEMBL3616154)
IC50 5.0±n/a nM
Citation Pagire, SHPagire, HSLee, GBHan, SJKwak, HJKim, JYKim, KYRhee, SDRyu, JISong, JSBae, MAPark, MJKim, DLee, DHAhn, JH Discovery and optimization of adamantane carboxylic acid derivatives as potent diacylglycerol acyltransferase 1 inhibitors for the potential treatment of obesity and diabetes. Eur J Med Chem101:716-35 (2015) 
 
Diacylglycerol O-acyltransferase 1
Name:Diacylglycerol O-acyltransferase 1
Type:Enzyme
Mol. Mass.:56810.61
Organism:Mus musculus (mouse)
Description:In this assay, recombinant mouse DGAT-1 containing an N-terminal His6-epitope tag was produced in the baculovirus expression system.
Residue:498
BDBM50117187
NameBDBM50117187
Synonyms:CHEMBL3613341
TypeSmall organic molecule
Emp. Form.C31H30F3N3O6
Mol. Mass.597.5816
SMILESOC(=O)C12CC3CC(C1)C(Oc1ccc(cc1)C(=O)NCCNC(=O)c1nc(oc1C(F)(F)F)-c1ccccc1)C(C3)C2