Reaction Details
TargetDiacylglycerol O-acyltransferase 1
LigandBDBM50117149
Substrate/Competitorn/a
Meas. Tech.ChEMBL_1513967 (CHEMBL3616153)
IC50 5.0±n/a nM
Citation Pagire, SHPagire, HSLee, GBHan, SJKwak, HJKim, JYKim, KYRhee, SDRyu, JISong, JSBae, MAPark, MJKim, DLee, DHAhn, JH Discovery and optimization of adamantane carboxylic acid derivatives as potent diacylglycerol acyltransferase 1 inhibitors for the potential treatment of obesity and diabetes. Eur J Med Chem101:716-35 (2015) 
 
Diacylglycerol O-acyltransferase 1
Name:Diacylglycerol O-acyltransferase 1
Type:Protein
Mol. Mass.:55297.82
Organism:Homo sapiens (Human)
Description:O75907
Residue:488
BDBM50117149
NameBDBM50117149
Synonyms:CHEMBL3613349
TypeSmall organic molecule
Emp. Form.C33H34N2O5
Mol. Mass.538.6335
SMILESOC(=O)[C@@]12CC3CC(C1)[C@H](Oc1ccc(cc1)C(=O)NCCNC(=O)c1ccc(cc1)-c1ccccc1)C(C3)C2