Reaction Details
TargetBranched-chain-amino-acid aminotransferase, mitochondrial
LigandBDBM50118520
Substrate/Competitorn/a
Meas. Tech.ChEMBL_1516909 (CHEMBL3618962)
IC50 158±n/a nM
Citation Bertrand, SMAncellin, NBeaufils, BBingham, RPBorthwick, JABoullay, ABBoursier, ECarter, PSChung, CWChurcher, IDodic, NFouchet, MHFournier, CFrancis, PLGummer, LAHerry, KHobbs, AHobbs, CIHomes, PJamieson, CNicodeme, EPickett, SDReid, IHSimpson, GLSloan, LASmith, SESomers, DOSpitzfaden, CSuckling, CJValko, KWashio, YYoung, RJ The Discovery of in Vivo Active Mitochondrial Branched-Chain Aminotransferase (BCATm) Inhibitors by Hybridizing Fragment and HTS Hits. J Med Chem58:7140-63 (2015) 
 
Branched-chain-amino-acid aminotransferase, mitochondrial
Name:Branched-chain-amino-acid aminotransferase, mitochondrial
Type:PROTEIN
Mol. Mass.:44297.81
Organism:Homo sapiens (Human)
Description:ChEMBL_109874
Residue:392
BDBM50118520
NameBDBM50118520
Synonyms:CHEMBL3617075
TypeSmall organic molecule
Emp. Form.C16H15BrN6O
Mol. Mass.387.234
SMILESCCCc1cc(=O)n2nc(NCc3ccc(Br)cn3)c(C#N)c2[nH]1