Reaction Details
TargetDelta-type opioid receptor
LigandBDBM50008984
Substrate/Competitorn/a
Meas. Tech.ChEMBL_1515760 (CHEMBL3614313)
IC50 3.5±n/a nM
Citation Deekonda, SWugalter, LKulkarni, VRankin, DLargent-Milnes, TMDavis, PBassirirad, NMLai, JVanderah, TWPorreca, FHruby, VJ Discovery of 5-substituted tetrahydronaphthalen-2yl-methyl with N-phenyl-N-(piperidin-4-yl)propionamide derivatives as potent opioid receptor ligands. Bioorg Med Chem23:6185-94 (2015) 
 
Delta-type opioid receptor
Name:Delta-type opioid receptor
Type:Enzyme Catalytic Domain
Mol. Mass.:40577.25
Organism:MOUSE
Description:P32300
Residue:372
BDBM50008984
NameBDBM50008984
Synonyms:4-(4-Chloro-benzyl)-2-(1-methyl-azepan-4-yl)-2H-phthalazin-1-one Duragesic-100 Duragesic-25 Duragesic-75 FENTANYL CITRATE Fentanyl-100 Fentanyl-25 Fentanyl-75 Innovar N-(1-Phenethyl-piperidin-4-yl)-N-phenyl-propionamide N-(1-phenethylpiperidin-4-yl)-N-phenylpropionamide | US20230399418, Compound Fentanyl
TypeSmall organic molecule
Emp. Form.C22H28N2O
Mol. Mass.336.4705
SMILESCCC(=O)N(C1CCN(CCc2ccccc2)CC1)c1ccccc1