Reaction Details
TargetSerine racemase
LigandBDBM14673
Substrate/Competitorn/a
Meas. Tech.ChEMBL_1516973 (CHEMBL3619308)
Ki 59000±n/a nM
Citation Dellafiora, LMarchetti, MSpyrakis, FOrlandi, VCampanini, BCruciani, GCozzini, PMozzarelli, A Expanding the chemical space of human serine racemase inhibitors. Bioorg Med Chem Lett25:4297-303 (2015) 
 
Serine racemase
Name:Serine racemase
Type:PROTEIN
Mol. Mass.:36565.80
Organism:Homo sapiens (Human)
Description:ChEMBL_1516972
Residue:340
BDBM14673
NameBDBM14673
Synonyms:Fragment 3 propanedioic acid
TypeSmall organic molecule
Emp. Form.C3H4O4
Mol. Mass.104.0615
SMILESOC(=O)CC(O)=O