Reaction Details
TargetSerine racemase
LigandBDBM50119564
Substrate/Competitorn/a
Meas. Tech.ChEMBL_1516972 (CHEMBL3619307)
Ki 1700000±n/a nM
Citation Dellafiora, LMarchetti, MSpyrakis, FOrlandi, VCampanini, BCruciani, GCozzini, PMozzarelli, A Expanding the chemical space of human serine racemase inhibitors. Bioorg Med Chem Lett25:4297-303 (2015) 
 
Serine racemase
Name:Serine racemase
Type:PROTEIN
Mol. Mass.:36565.80
Organism:Homo sapiens (Human)
Description:ChEMBL_1516972
Residue:340
BDBM50119564
NameBDBM50119564
Synonyms:CHEMBL3617723
TypeSmall organic molecule
Emp. Form.C11H13N3O7
Mol. Mass.299.2368
SMILES[#6]-[#7]-1-[#6](=O)-[#7](-[#6])-[#6](=O)\[#6](=[#6]\[#7]-[#6](-[#6]-[#6](-[#8])=O)-[#6](-[#8])=O)-[#6]-1=O