Reaction Details
TargetPancreatic alpha-amylase
LigandBDBM50120848
Substrate/Competitorn/a
Meas. Tech.ChEMBL_1516316 (CHEMBL3618756)
Ki 1250±n/a nM
Citation Al-Asri, JFazekas, ELehoczki, GPerdih, AGörick, CMelzig, MFGyémánt, GWolber, GMortier, J From carbohydrates to drug-like fragments: Rational development of novela-amylase inhibitors. Bioorg Med Chem23:6725-32 (2015) 
 
Pancreatic alpha-amylase
Name:Pancreatic alpha-amylase
Type:Protein
Mol. Mass.:57709.71
Organism:Homo sapiens (Human)
Description:n/a
Residue:511
BDBM50120848
NameBDBM50120848
Synonyms:CHEMBL3618488
TypeSmall organic molecule
Emp. Form.C37H63NO28
Mol. Mass.969.886
SMILESCC1OC(OC2C(CO)OC(OC3C(CO)OC(O)C(O)C3O)C(O)C2O)C(O)C(O)C1NC1C=C(CO)C(OC2OC(CO)C(OC3OC(CO)C(O)C(O)C3O)C(O)C2O)C(O)C1O