Reaction Details
TargetPancreatic alpha-amylase
LigandBDBM50120856
Substrate/Competitorn/a
Meas. Tech.ChEMBL_1516321 (CHEMBL3618913)
Ki 6100±n/a nM
Citation Al-Asri, JFazekas, ELehoczki, GPerdih, AGörick, CMelzig, MFGyémánt, GWolber, GMortier, J From carbohydrates to drug-like fragments: Rational development of novela-amylase inhibitors. Bioorg Med Chem23:6725-32 (2015) 
 
Pancreatic alpha-amylase
Name:Pancreatic alpha-amylase
Type:Protein
Mol. Mass.:57709.71
Organism:Homo sapiens (Human)
Description:n/a
Residue:511
BDBM50120856
NameBDBM50120856
Synonyms:CHEMBL3618495
TypeSmall organic molecule
Emp. Form.C55H68O32
Mol. Mass.1241.1092
SMILESCOc1cc(\C=C\C(=O)OC[C@H]2O[C@@H](O[C@@H]3[C@H](O)[C@@H](O)[C@H](C)O[C@H]3OC3=C(Cc4cc(O)cc(O)c4C3=O)c3cc(O)c(O[C@@H]4OC[C@@H](O[C@@H]5O[C@@H](C)[C@H](O)[C@@H](O)[C@H]5O)[C@H](O)[C@H]4O)c(O)c3)[C@H](O[C@@H]3O[C@H](CO)[C@@H](O)[C@H](O)[C@H]3O)[C@@H](O)[C@@H]2O)ccc1O