Reaction Details
TargetHistamine receptor H4
LigandBDBM50356884
Substrate/Competitorn/a
Meas. Tech.ChEMBL_1521721 (CHEMBL3626544)
Ki 123±n/a nM
Citation Tichenor, MSThurmond, RLVenable, JDSavall, BM Functional Profiling of 2-Aminopyrimidine Histamine H4 Receptor Modulators. J Med Chem58:7119-27 (2015) 
 
Histamine receptor H4
Name:Histamine receptor H4
Type:Enzyme Catalytic Domain
Mol. Mass.:44536.99
Organism:GUINEA PIG
Description:HISTAMINE H4 HRH4 GUINEA PIG::Q91ZY3
Residue:389
BDBM50356884
NameBDBM50356884
Synonyms:CHEMBL1915540
TypeSmall organic molecule
Emp. Form.C13H22N6
Mol. Mass.262.354
SMILESCN[C@@H]1CCN(C1)c1cc(NCC2CC2)nc(N)n1