Reaction Details
TargetCarbonic anhydrase 2
LigandBDBM26990
Substrate/Competitorn/a
Meas. Tech.ChEMBL_1521735 (CHEMBL3626558)
Ki 2800±n/a nM
Citation Mahon, BPDíaz-Torres, NAPinard, MATu, CSilverman, DNScott, KMMcKenna, R Activity and anion inhibition studies of thea-carbonic anhydrase from Thiomicrospira crunogena XCL-2 Gammaproteobacterium. Bioorg Med Chem Lett25:4937-40 (2015) 
 
Carbonic anhydrase 2
Name:Carbonic anhydrase 2
Type:Enzyme
Mol. Mass.:29250.71
Organism:Homo sapiens (Human)
Description:P00918
Residue:260
BDBM26990
NameBDBM26990
Synonyms:CHEMBL1644699 HS(-1) hydrosulfide | sulfanide
TypeIon
Emp. Form.HS
Mol. Mass.33.073
SMILES[SH-]